BDBM50049074 2-(5-Decyl-1H-indol-3-yl)-ethylamine::CHEMBL414420
SMILES CCCCCCCCCCc1ccc2[nH]cc(CCN)c2c1
InChI Key InChIKey=TYGFQVPXFAQMRF-UHFFFAOYSA-N
Data  3 KI
  Tab Delimited (TSV)   2D SDfile   Computed 3D by Vconf -m prep SDfile
Find this compound or compounds like it in BindingDB:
Activity Spreadsheet -- Enzyme Inhibition Constant Data from BindingDB
Found 1 hit for monomerid = 50049074
Target5-hydroxytryptamine receptor 1B(Homo sapiens (Human))
Virginia Commonwealth University
Curated by ChEMBL
LigandPNGBDBM50049074(2-(5-Decyl-1H-indol-3-yl)-ethylamine | CHEMBL41442...)
Affinity DataKi:  275nM. Assay description: Binding affinity for recombinant human 5-hydroxytryptamine 1D receptor beta was determined using [3H]-5-HT as radioligand
In DepthDetails ArticlePubMed